{"text_format":"3","workbook":"xlsx","n_sheets":9,"sheets":["Data","Organisations","Dashboard","Report 2","Calculated table","Vocabulary","Gears","Geometry","Setup Instructions"],"not_rendered":{"charts":2,"images":14,"macros":1,"defined_names":108},"read":"whole","date_system":"1900"}

{"sheet":"Data","index":0,"n_rows":6,"n_cols":18,"rows_kept":6,"merged":[[0,1,0,6]]}
[null,"3W Data Entry - Use the 3W data entry tool to add/delete entries (Menu > 3W TOOLBOX)",{"$nulls":9},"HIDE THESE COLUMNS"]
[null,null,"Add a new organisation"]
[]
[null,"Acronym","Organisation","Org Type","Sector","Activity Type","Admin Unit Name","Pcode","Beneficiaries","Concatenate","Check Duplicated Entries","PT.Concat","Count PT.Concat","PT.ID","PT.FirstID","PT.LastID.Row","PT.LstOrg","PT.Show"]
[null,"TO",{"$f":"INDEX(Organizations[],MATCH(Main3WData[[#This Row],[Acronym]],AcronymList,0),1)","v":"Testing Organisation"},{"$f":"INDEX(Organizations[],MATCH(Main3WData[[#This Row],[Acronym]],AcronymList,0),3)","v":"National NGO"},"Education","Emergency","Anbar",{"$f":"VLOOKUP(Main3WData[[#This Row],[Admin Unit Name]],AdminUnits[],2,FALSE)","v":"IQ-G01"},0,{"$f":"Main3WData[[#This Row],[Acronym]]&Main3WData[[#This Row],[Sector]]&Main3WData[[#This Row],[Activity Type]]&Main3WData[[#This Row],[Pcode]]","v":"TOEducationEmergencyIQ-G01"},{"$f":"COUNTIF(Main3WData[Concatenate],Main3WData[[#This Row],[Concatenate]])","v":1},{"$f":"Main3WData[[#This Row],[Sector]]&Main3WData[[#This Row],[Pcode]]","v":"EducationIQ-G01"},{"$f":"COUNTIF($L$5:L5,Main3WData[[#This Row],[PT.Concat]])","v":1},{"$f":"MATCH(Main3WData[[#This Row],[PT.Concat]],$L$5:L5,0)","v":1},{"$f":"Main3WData[[#This Row],[Count PT.Concat]]=1","v":true},{"$f":"MAX(($N$4:N4=Main3WData[[#This Row],[PT.ID]])*ROW($N$4:N4))","v":0},{"$f":"IF(Main3WData[[#This Row],[PT.FirstID]],Main3WData[[#This Row],[Acronym]],INDEX($Q$4:Q4,Main3WData[[#This Row],[PT.LastID.Row]]-ROW($Q$4)+1) & \", \"&Main3WData[[#This Row],[Acronym]])","v":"TO"},{"$f":"MAX(IF(Main3WData[PT.ID]=Main3WData[[#This Row],[PT.ID]],Main3WData[PT.LastID.Row]))=Main3WData[[#This Row],[PT.LastID.Row]]","v":true}]
[null,"TO",{"$f":"INDEX(Organizations[],MATCH(Main3WData[[#This Row],[Acronym]],AcronymList,0),1)","v":"Testing Organisation"},{"$f":"INDEX(Organizations[],MATCH(Main3WData[[#This Row],[Acronym]],AcronymList,0),3)","v":"National NGO"},"Education","Emergency","Dahuk",{"$f":"VLOOKUP(Main3WData[[#This Row],[Admin Unit Name]],AdminUnits[],2,FALSE)","v":"IQ-G08"},0,{"$f":"Main3WData[[#This Row],[Acronym]]&Main3WData[[#This Row],[Sector]]&Main3WData[[#This Row],[Activity Type]]&Main3WData[[#This Row],[Pcode]]","v":"TOEducationEmergencyIQ-G08"},{"$f":"COUNTIF(Main3WData[Concatenate],Main3WData[[#This Row],[Concatenate]])","v":1},{"$f":"Main3WData[[#This Row],[Sector]]&Main3WData[[#This Row],[Pcode]]","v":"EducationIQ-G08"},{"$f":"COUNTIF($L$5:L6,Main3WData[[#This Row],[PT.Concat]])","v":1},{"$f":"MATCH(Main3WData[[#This Row],[PT.Concat]],$L$5:L6,0)","v":2},{"$f":"Main3WData[[#This Row],[Count PT.Concat]]=1","v":true},{"$f":"MAX(($N$4:N5=Main3WData[[#This Row],[PT.ID]])*ROW($N$4:N5))","v":0},{"$f":"IF(Main3WData[[#This Row],[PT.FirstID]],Main3WData[[#This Row],[Acronym]],INDEX($Q$4:Q5,Main3WData[[#This Row],[PT.LastID.Row]]-ROW($Q$4)+1) & \", \"&Main3WData[[#This Row],[Acronym]])","v":"TO"},{"$f":"MAX(IF(Main3WData[PT.ID]=Main3WData[[#This Row],[PT.ID]],Main3WData[PT.LastID.Row]))=Main3WData[[#This Row],[PT.LastID.Row]]","v":true}]
{"$rows_left_out":1}
{"sheet":"Organisations","index":1,"n_rows":2,"n_cols":3,"rows_kept":2}
["Name","Acronym","Type"]
["Testing Organisation","TO","National NGO"]

{"sheet":"Dashboard","index":2,"n_rows":9,"n_cols":2,"rows_kept":9,"merged":[[6,9,8,12]]}
[]
[null,"Select the type of activity you want to see in the dashboard:"]
[]
[null,"Emergency"]
[]
[null,"Go to the 3W Data Entry Page"]
{"$rows_left_out":4}
{"sheet":"Report 2","index":3,"n_rows":22,"n_cols":13,"rows_kept":22,"merged":[[3,12,5,13]]}
[]
[]
[]
[null,"PCODE","Governorate","Education","Food Security and Agriculture","Health","Shelter and NFIs","WASH","Protection","Emergency Telecommunication","Logistics",null,"This table updates automatically based on columns L-R from the \"Data\" sheet. On this sheet, you just need to edit sectors in row 4 and Pcodes & locations in column B & C."]
[null,"IQ-G01","Anbar",{"$f":"_xlfn.IFNA(INDEX(Main3WData[PT.LstOrg],MATCH(CONCATENATE(D$4&$B5)&TRUE,Main3WData[PT.Concat]&Main3WData[PT.Show],0)),\"\")","v":"TO"},{"$f":"_xlfn.IFNA(INDEX(Main3WData[PT.LstOrg],MATCH(CONCATENATE(E$4&$B5)&TRUE,Main3WData[PT.Concat]&Main3WData[PT.Show],0)),\"\")","v":""},{"$f":"_xlfn.IFNA(INDEX(Main3WData[PT.LstOrg],MATCH(CONCATENATE(F$4&$B5)&TRUE,Main3WData[PT.Concat]&Main3WData[PT.Show],0)),\"\")","v":""},{"$f":"_xlfn.IFNA(INDEX(Main3WData[PT.LstOrg],MATCH(CONCATENATE(G$4&$B5)&TRUE,Main3WData[PT.Concat]&Main3WData[PT.Show],0)),\"\")","v":""},{"$f":"_xlfn.IFNA(INDEX(Main3WData[PT.LstOrg],MATCH(CONCATENATE(H$4&$B5)&TRUE,Main3WData[PT.Concat]&Main3WData[PT.Show],0)),\"\")","v":""},{"$f":"_xlfn.IFNA(INDEX(Main3WData[PT.LstOrg],MATCH(CONCATENATE(I$4&$B5)&TRUE,Main3WData[PT.Concat]&Main3WData[PT.Show],0)),\"\")","v":""},{"$f":"_xlfn.IFNA(INDEX(Main3WData[PT.LstOrg],MATCH(CONCATENATE(J$4&$B5)&TRUE,Main3WData[PT.Concat]&Main3WData[PT.Show],0)),\"\")","v":""},{"$f":"_xlfn.IFNA(INDEX(Main3WData[PT.LstOrg],MATCH(CONCATENATE(K$4&$B5)&TRUE,Main3WData[PT.Concat]&Main3WData[PT.Show],0)),\"\")","v":""}]
[null,"IQ-G08","Dahuk",{"$f":"_xlfn.IFNA(INDEX(Main3WData[PT.LstOrg],MATCH(CONCATENATE(D$4&$B6)&TRUE,Main3WData[PT.Concat]&Main3WData[PT.Show],0)),\"\")","v":"TO"},{"$f":"_xlfn.IFNA(INDEX(Main3WData[PT.LstOrg],MATCH(CONCATENATE(E$4&$B6)&TRUE,Main3WData[PT.Concat]&Main3WData[PT.Show],0)),\"\")","v":""},{"$f":"_xlfn.IFNA(INDEX(Main3WData[PT.LstOrg],MATCH(CONCATENATE(F$4&$B6)&TRUE,Main3WData[PT.Concat]&Main3WData[PT.Show],0)),\"\")","v":""},{"$f":"_xlfn.IFNA(INDEX(Main3WData[PT.LstOrg],MATCH(CONCATENATE(G$4&$B6)&TRUE,Main3WData[PT.Concat]&Main3WData[PT.Show],0)),\"\")","v":""},{"$f":"_xlfn.IFNA(INDEX(Main3WData[PT.LstOrg],MATCH(CONCATENATE(H$4&$B6)&TRUE,Main3WData[PT.Concat]&Main3WData[PT.Show],0)),\"\")","v":""},{"$f":"_xlfn.IFNA(INDEX(Main3WData[PT.LstOrg],MATCH(CONCATENATE(I$4&$B6)&TRUE,Main3WData[PT.Concat]&Main3WData[PT.Show],0)),\"\")","v":""},{"$f":"_xlfn.IFNA(INDEX(Main3WData[PT.LstOrg],MATCH(CONCATENATE(J$4&$B6)&TRUE,Main3WData[PT.Concat]&Main3WData[PT.Show],0)),\"\")","v":""},{"$f":"_xlfn.IFNA(INDEX(Main3WData[PT.LstOrg],MATCH(CONCATENATE(K$4&$B6)&TRUE,Main3WData[PT.Concat]&Main3WData[PT.Show],0)),\"\")","v":""}]
{"$rows_left_out":17}
{"sheet":"Calculated table","index":4,"n_rows":24,"n_cols":14,"rows_kept":24,"merged":[[2,2,2,3],[2,13,11,14]]}
[]
[]
[null,{"$f":"B4","v":"Governorate"},{"$f":"C4","v":"Number of IDPs\n(Planning Figure*)"},{"$nulls":10},"This table updates automatically. You just need to edit sectors in row 4 (hidden) and locations in column B.\nA linked picture is already embeded on the dashboard."]
[null,"Governorate","Number of IDPs\n(Planning Figure*)","Column1","Education","Food Security and Agriculture","Health","Shelter and NFIs","WASH","Protection","Emergency Telecommunication","Logistics"]
[null,{"$f":"INDEX(AdminNamesList,ROWS($B$5:B5))","v":"Anbar"},{"$f":"Table11[[#This Row],[Column1]]","v":362238},{"v":362238,"d":"362,238"},{"$f":"INDEX(Gears!$C$6:$J$23,MATCH(Table11[[#This Row],[Governorate]],Gears!$A$6:$A$23,0),MATCH('Calculated table'!E$4,Gears!$C$5:$J$5,0))","v":1},{"$f":"INDEX(Gears!$C$6:$J$23,MATCH(Table11[[#This Row],[Governorate]],Gears!$A$6:$A$23,0),MATCH('Calculated table'!F$4,Gears!$C$5:$J$5,0))","v":0},{"$f":"INDEX(Gears!$C$6:$J$23,MATCH(Table11[[#This Row],[Governorate]],Gears!$A$6:$A$23,0),MATCH('Calculated table'!G$4,Gears!$C$5:$J$5,0))","v":0},{"$f":"INDEX(Gears!$C$6:$J$23,MATCH(Table11[[#This Row],[Governorate]],Gears!$A$6:$A$23,0),MATCH('Calculated table'!H$4,Gears!$C$5:$J$5,0))","v":0},{"$f":"INDEX(Gears!$C$6:$J$23,MATCH(Table11[[#This Row],[Governorate]],Gears!$A$6:$A$23,0),MATCH('Calculated table'!I$4,Gears!$C$5:$J$5,0))","v":0},{"$f":"INDEX(Gears!$C$6:$J$23,MATCH(Table11[[#This Row],[Governorate]],Gears!$A$6:$A$23,0),MATCH('Calculated table'!J$4,Gears!$C$5:$J$5,0))","v":0},{"$f":"INDEX(Gears!$C$6:$J$23,MATCH(Table11[[#This Row],[Governorate]],Gears!$A$6:$A$23,0),MATCH('Calculated table'!K$4,Gears!$C$5:$J$5,0))","v":0},{"$f":"INDEX(Gears!$C$6:$J$23,MATCH(Table11[[#This Row],[Governorate]],Gears!$A$6:$A$23,0),MATCH('Calculated table'!L$4,Gears!$C$5:$J$5,0))","v":0}]
[null,{"$f":"INDEX(AdminNamesList,ROWS($B$5:B6))","v":"Dahuk"},{"$f":"Table11[[#This Row],[Column1]]","v":452004},{"v":452004,"d":"452,004"},{"$f":"INDEX(Gears!$C$6:$J$23,MATCH(Table11[[#This Row],[Governorate]],Gears!$A$6:$A$23,0),MATCH('Calculated table'!E$4,Gears!$C$5:$J$5,0))","v":1},{"$f":"INDEX(Gears!$C$6:$J$23,MATCH(Table11[[#This Row],[Governorate]],Gears!$A$6:$A$23,0),MATCH('Calculated table'!F$4,Gears!$C$5:$J$5,0))","v":0},{"$f":"INDEX(Gears!$C$6:$J$23,MATCH(Table11[[#This Row],[Governorate]],Gears!$A$6:$A$23,0),MATCH('Calculated table'!G$4,Gears!$C$5:$J$5,0))","v":0},{"$f":"INDEX(Gears!$C$6:$J$23,MATCH(Table11[[#This Row],[Governorate]],Gears!$A$6:$A$23,0),MATCH('Calculated table'!H$4,Gears!$C$5:$J$5,0))","v":0},{"$f":"INDEX(Gears!$C$6:$J$23,MATCH(Table11[[#This Row],[Governorate]],Gears!$A$6:$A$23,0),MATCH('Calculated table'!I$4,Gears!$C$5:$J$5,0))","v":0},{"$f":"INDEX(Gears!$C$6:$J$23,MATCH(Table11[[#This Row],[Governorate]],Gears!$A$6:$A$23,0),MATCH('Calculated table'!J$4,Gears!$C$5:$J$5,0))","v":0},{"$f":"INDEX(Gears!$C$6:$J$23,MATCH(Table11[[#This Row],[Governorate]],Gears!$A$6:$A$23,0),MATCH('Calculated table'!K$4,Gears!$C$5:$J$5,0))","v":0},{"$f":"INDEX(Gears!$C$6:$J$23,MATCH(Table11[[#This Row],[Governorate]],Gears!$A$6:$A$23,0),MATCH('Calculated table'!L$4,Gears!$C$5:$J$5,0))","v":0}]
{"$rows_left_out":19}
{"sheet":"Vocabulary","index":5,"n_rows":19,"n_cols":21,"rows_kept":19,"merged":[[4,3,4,6],[7,13,7,16],[9,13,10,16]]}
[null,"Sector",null,"Activity Type","ID","TitleBarText","Dashboard Text",null,"Organiztion Type",null,"AdminName","Pcode",null,"R","G","B","Color",null,"Number of Dashboard Maps",null,"Is Setup Complete"]
[null,"Education",null,"Regular",3,"Regular Programs","Organisations working in Iraq",null,"Donor",null,"Anbar","IQ-G01",null,255,255,255,"sample color",null,{"$f":"COUNTA(Sectors[]) + 1","v":9},null,true]
[null,"Food Security and Agriculture",null,"Emergency",2,"Emergency Programs","Organisations working in Iraq",null,"Development",null,"Dahuk","IQ-G08",null,199,214,238,"sample color"]
[null,"Health",null,"All Programs",1,"","Organisations working in Iraq",null,"Regional Entities",null,"Baghdad","IQ-G07",null,149,182,223,"sample color"]
[null,"Shelter and NFIs",null,"DO NOT ADD MORE ROWS TO THIS TABLE",{"$nulls":4},"Government",null,"Basrah","IQ-G02",null,101,154,210,"sample color"]
[null,"WASH",{"$nulls":6},"International NGO",null,"Babylon","IQ-G06",null,2,108,182,"sample color"]
{"$rows_left_out":14}
{"sheet":"Gears","index":6,"n_rows":46,"n_cols":33,"rows_kept":46}
[]
[]
[{"$nulls":15},"Color Classification"]
["Unique Orgs by Admin Unit and Sector",{"$nulls":10},"Unique Orgs by Admin Unit and Activity Type",{"$nulls":3},"All Sectors",null,"Education",null,"Food Security and Agriculture",null,"Health",null,"Shelter and NFIs",null,"WASH",null,"Protection",null,"Emergency Telecommunication",null,"Logistics"]
["AdminName","Pcode","Education","Food Security and Agriculture","Health","Shelter and NFIs","WASH","Protection","Emergency Telecommunication","Logistics",null,"Regular","Emergency","All Programs",null,"Current Activity Type","Bins","Rank","Bins","Rank","Bins","Rank","Bins","Rank","Bins","Rank","Bins","Rank","Bins","Rank","Bins","Rank","Bins"]
["Anbar","IQ-G01",{"$f":"IF(Activity<>\"All Programs\",COUNTIFS(Data!$E:$E,C$5,Data!$G:$G,$A6,Data!$F:$F,Activity),COUNTIFS(Data!$E:$E,C$5,Data!$G:$G,$A6))","v":1},{"$f":"IF(Activity<>\"All Programs\",COUNTIFS(Data!$E:$E,D$5,Data!$G:$G,$A6,Data!$F:$F,Activity),COUNTIFS(Data!$E:$E,D$5,Data!$G:$G,$A6))","v":0},{"$f":"IF(Activity<>\"All Programs\",COUNTIFS(Data!$E:$E,E$5,Data!$G:$G,$A6,Data!$F:$F,Activity),COUNTIFS(Data!$E:$E,E$5,Data!$G:$G,$A6))","v":0},{"$f":"IF(Activity<>\"All Programs\",COUNTIFS(Data!$E:$E,F$5,Data!$G:$G,$A6,Data!$F:$F,Activity),COUNTIFS(Data!$E:$E,F$5,Data!$G:$G,$A6))","v":0},{"$f":"IF(Activity<>\"All Programs\",COUNTIFS(Data!$E:$E,G$5,Data!$G:$G,$A6,Data!$F:$F,Activity),COUNTIFS(Data!$E:$E,G$5,Data!$G:$G,$A6))","v":0},{"$f":"IF(Activity<>\"All Programs\",COUNTIFS(Data!$E:$E,H$5,Data!$G:$G,$A6,Data!$F:$F,Activity),COUNTIFS(Data!$E:$E,H$5,Data!$G:$G,$A6))","v":0},{"$f":"IF(Activity<>\"All Programs\",COUNTIFS(Data!$E:$E,I$5,Data!$G:$G,$A6,Data!$F:$F,Activity),COUNTIFS(Data!$E:$E,I$5,Data!$G:$G,$A6))","v":0},{"$f":"IF(Activity<>\"All Programs\",COUNTIFS(Data!$E:$E,J$5,Data!$G:$G,$A6,Data!$F:$F,Activity),COUNTIFS(Data!$E:$E,J$5,Data!$G:$G,$A6))","v":0},null,{"$f":"SUM(IF(FREQUENCY(IF((LEN(Data_Acro)>0)*(Data_Act=\"Regular\")*(Data_Pcd=B6),MATCH(Data_Acro,Data_Acro,0),\"\"),IF((LEN(Data_Acro)>0)*(Data_Act=\"Regular\")*(Data_Pcd=B6),MATCH(Data_Acro,Data_Acro,0),\"\"))>0,1))","v":0},{"$f":"SUM(IF(FREQUENCY(IF((LEN(Data_Acro)>0)*(Data_Act=\"Emergency\")*(Data_Pcd=B6),MATCH(Data_Acro,Data_Acro,0),\"\"),IF((LEN(Data_Acro)>0)*(Data_Act=\"Emergency\")*(Data_Pcd=B6),MATCH(Data_Acro,Data_Acro,0),\"\"))>0,1))","v":1},{"$f":"SUM(IF(FREQUENCY(IF((LEN(Data_Acro)>0)*(Data_Pcd=B6),MATCH(Data_Acro,Data_Acro,0),\"\"),IF((LEN(Data_Acro)>0)*(Data_Pcd=B6),MATCH(Data_Acro,Data_Acro,0),\"\"))>0,1))","v":1},null,{"$f":"IF(M6=0,1,IFERROR(MATCH(M6,$Q$6:$Q$10,1)+1,1))","v":6},{"$f":"MIN(IF(OrgByAdmin_Emg>0,OrgByAdmin_Emg))","v":1},{"$f":"IF(INDEX(SectorCount0,1)=0,1,MATCH(INDEX(SectorCount0,1),SectorCountBins0,1)+1)","v":6},{"$f":"IF(StdScale=\"Yes\",1,MIN(IF(SectorCount0>0,SectorCount0)))","v":1},{"$f":"IF(INDEX(SectorCount1,1)=0,1,MATCH(INDEX(SectorCount1,1),SectorCountBins1,1)+1)","v":1},{"$f":"IF(StdScale=\"Yes\",1,MIN(IF(SectorCount1>0,SectorCount1)))","v":1},{"$f":"IF(INDEX(SectorCount2,1)=0,1,MATCH(INDEX(SectorCount2,1),SectorCountBins2,1)+1)","v":1},{"$f":"IF(StdScale=\"Yes\",1,MIN(IF(SectorCount2>0,SectorCount2)))","v":1},{"$f":"IF(INDEX(SectorCount3,1)=0,1,MATCH(INDEX(SectorCount3,1),SectorCountBins3,1)+1)","v":1},{"$f":"IF(StdScale=\"Yes\",1,MIN(IF(SectorCount3>0,SectorCount3)))","v":1},{"$f":"IF(INDEX(SectorCount4,1)=0,1,MATCH(INDEX(SectorCount4,1),SectorCountBins4,1)+1)","v":1},{"$f":"IF(StdScale=\"Yes\",1,MIN(IF(SectorCount4>0,SectorCount4)))","v":1},{"$f":"IF(INDEX(SectorCount5,1)=0,1,MATCH(INDEX(SectorCount5,1),SectorCountBins5,1)+1)","v":1},{"$f":"IF(StdScale=\"Yes\",1,MIN(IF(SectorCount5>0,SectorCount5)))","v":1},{"$f":"IF(INDEX(SectorCount6,1)=0,1,MATCH(INDEX(SectorCount6,1),SectorCountBins6,1)+1)","v":1},{"$f":"IF(StdScale=\"Yes\",1,MIN(IF(SectorCount6>0,SectorCount6)))","v":1},{"$f":"IF(INDEX(SectorCount7,1)=0,1,MATCH(INDEX(SectorCount7,1),SectorCountBins7,1)+1)","v":1},{"$f":"IF(StdScale=\"Yes\",1,MIN(IF(SectorCount7>0,SectorCount7)))","v":1}]
{"$rows_left_out":41}
{"sheet":"Geometry","index":7,"n_rows":29,"n_cols":1,"rows_kept":29}
[]
["Go to instructions"]
{"$rows_empty":8}
["Paste Pcodes Below (1 Column Only)"]
["IQ01"]
["IQ08"]
{"$rows_left_out":17}
{"sheet":"Setup Instructions","index":8,"n_rows":0,"n_cols":0,"rows_kept":0}